{"text_format":"1","workbook":"xlsx","n_sheets":5,"sheets":["Inputs","Instructions - Simulator sheet","Simulator","Example results","Read me whenever!"],"not_rendered":{"charts":1,"images":13,"macros":1,"external_links":0,"defined_names":34,"comments":0,"pivot_tables":0},"unopened":[],"bounds":{"document_bytes":16777216,"sheet_cells":100000,"rows_first":2000,"rows_last":500,"rows_between":2000,"halvings":0,"cell_chars":16384,"cell_head_chars":4096},"cells_cut":0,"cells_raw":0,"read":"whole","date_system":"1900"}

{"sheet":"Inputs","index":0,"n_rows":41,"n_cols":8,"rows_kept":41,"cut":false,"hidden":false,"merged":[]}
["This excel sheet uses MACRO's. You will need to enable them before proceeding. Zoom each sheet according to your convenience"]
[]
["Read and complete entries in this column first"]
["Fill only cell in green",null,null,"The corpus that you enter will divided into 5 buckets, that is different instruments as listed below. "]
["Current monthly expenses",10000," ","Enter the % allocation to each bucket. Bucket 1 represents a fixed income instrument like a FD. So returns will not vary"]
["Time to retirement",25,null,"For the other buckets you need to enter an average return and variation from this average (explained below)"]
["inflation prior retirement",0.08,null," The simulator will randomly generate (uncorrelated) returns for each year in retirement based on the input average return and variation"]
["Years in retirement",25,null,"Income for first few retirement years will come from bucket 1. This allows enough time for the sum invested in other buckets"]
["inflation post-retirement",0.08,null,"to appreciate. You can transfer from buckets 2-5 to bucket 1 if (a) you have made good returns in a year or (b) you don't have"]
["Annual expenses in 1st year of retirement",{"$f":"B5*12*(1+B7)^(B6+1)","v":887562.38543002447},null,"enough funds in bucket 1 to continue. You can transfer sums among buckets 2-5."]
["Average return for post-retirement investments",0.08,null,"Usually it is recommend that one makes a transfer to bucket 1 only if the average compounded rate of return is close to historcial"]
["Total corpus needed to meet expenses",{"$f":"PV((1+retroi)/(1+rinf)-1,k,-prepen1,,1)","v":22189059.63575061},null,"returns (10-15% approx.). Unfortunately inflation in India hovers around 8% and this may not work"]
["Thus  while the corpus grows at an average rate you draw ",null,null,"This approach is known as defined withdrawals strategy or the retirement bucket strategy"]
["from it each year  accoring to your expenses (indexed to inflation).",null,null,"The idea of the simulator is to try and prolong the life of the corpus (you chose!) while accouting for inflation-indexed expenses."]
["This corpus will become zero at the end of retirement period",null,null,"With intelligent transfers can you beat the standard withdrawal method? If you are not used to equity investing then "]
["This is known as the systematic withdrawals strategy",null,null,"you will need to try several times! Don't give up. This strategy can make a big difference to your retirement plan"]
["Is there a way to cope with a lower corpus?"]
["Is there a way to make the corpus last longer?",null,null,null,"Instrument","Allocation","Fixed Return","This allocation (bucket 1) will approx. last for (years)*"]
["This simulator attempts to see if this is possible*",null,null,"Bucket 1","Fixed Income (Bank FD)",0.45,0.05,{"$f":"NPER((1+_min1)/(1+rinf)-1,-prepen1,F19*B20,,1)","v":9.0314419660977094}]
["Enter corpus you think will fund your retirement",20000000,null,null,null,null,"Average Return","Variation from average return (std. dev.)"]
{"$rows_left_out":22}
{"sheet":"Instructions - Simulator sheet","index":1,"n_rows":26,"n_cols":20,"rows_kept":26,"cut":false,"hidden":false,"merged":[]}
["1. To obtain a fresh set of random returns press this"]
[null,null,null,null,null,null,null,null,null,null,null,"2. To advance to the next year press this",null,null,null,null,null,null,null,"3.For the same interest rate data set click this to redo the exercise!"]
[]
[]
["4. Before advancing remember to review: (a). balances in each bucket."]
["(b). compounded annual growth rate (CAGR) of the buckets."]
["A good thumb rule is to sell if the CAGR is close to or above"]
["the average rate of each bucket you have entered in the 'Inputs' sheet"]
[]
[]
[]
[]
[]
[]
[]
[]
[]
[]
[]
["6.In the screenshot 21 is the current year. However bucket 1 has funds only"]
{"$rows_left_out":7}
{"sheet":"Simulator","index":2,"n_rows":111,"n_cols":55,"rows_kept":111,"cut":false,"hidden":false,"merged":[[9,53,9,54],[9,47,9,48],[9,51,9,52],[7,24,7,25],[8,24,8,25],[7,26,7,27],[8,26,8,27],[9,24,9,25],[9,26,9,27],[6,26,6,27],[5,3,5,12],[5,14,5,18],[5,20,5,27],[6,24,6,25],[6,22,6,23],[6,20,6,21],[2,4,2,12],[7,22,7,23],[8,22,8,23],[7,20,7,21],[8,20,8,21],[9,20,9,21],[9,22,9,23]]}
[null,null,null,null,null,null,null,null,null,null,null,null,null,null,null,null,null,null,null,null,null,null,null,null,null,null,null,null,null,null,null,null,null,null,null,null,null,null,null,null,{"$f":"IF(Inputs!F19+Inputs!F21+Inputs!F22+Inputs!F23+Inputs!F24=100%,1,0)","v":1}]
[]
[null,null,null,null,"Compound Annual Growth Rate",null,null,null,null,null,null,null,null,null,"Current Year",null,{"$f":"MAX(AQ12:AQ111)","v":0},null,null,null,null,null,null,null,null,null,null,null,null,null,null,null,null,null,null,null,null,null,null,14,{"$f":"SUM(AQ12:AQ111)","v":0}]
[null,null,null,null,"Bucket 1","Bucket 2",null,"Bucket 3",null,"Bucket 4",null,null,"Bucket 5",null,"Bucket 1 can support expenses up to year",null,null,null,{"$f":"SUM(AN12:AN1111)-1","v":9},null,"If cells in the 'transfers' coumns turn red it means you are trying to transfer "]
[null,null,null,null,{"$f":"_min1","v":0.05},null,null,null,null,null,null,null,null,null,"To continue transfer",null,{"$f":"SUM(AM12:AM111)","v":4.8180637453394457},"lakhs to bucket 1",null,null,"more than the available balance. Decrease amt until the 'red' goes away",null,null,null,null,null,null,null,null,null,null,null,null,null,null,null,null,null,null,null,10]
[null,null,null,"Random Annual Returns",null,null,null,null,null,null,null,null,null,null,"BALANCES (Lakhs)",null,null,null,null,null,"TRANSFERS (Lakhs)",null,null,null,null,null,null,null,null,null,null,null,null,null,null,null,null,null,null,null,"Show"]
[null,"Net annual",null,null,"Bucket 1","Bucket 2",null,"Bucket 3",null,"Bucket 4",null,null,"Bucket 5",null,"Bucket 1","Bucket 2","Bucket 3","Bucket 4","Bucket 5",null,"Bucket 2",null,"Bucket 3",null,"Bucket 4",null,"Bucket 5",null,null,null,null,null,null,null,null,null,null,null,null,null,"Hide"]
[null,"expenses",null,null,"Fixed","Debt Fund",null,"Hybrid",null,"Large-cap",null,null,"Mid/Small ",null,"Fixed","Debt Fund","Hybrid","Large-cap","Mid/Small ",null,"Debt Fund",null,"Hybrid",null,"Large-cap",null,"Mid/Small Cap"]
[null,"that will be ",null,null,"(eg. FDs)",null,null,"Bal. Fund",null,"Stocks/MF",null,null,"Stocks/MF",null,"(eg. FDs)",null,"Bal. Fund","Stocks/MF","Stocks/MF",null,null,null,"Balanced Fund",null,"Stocks/MF",null,"Stocks/MF",null,null,null,null,null,null,null,null,null,null,null,null,null,"Bucket 2"]
[null,"covered",null,null," Income",null,null,null,null,null,null,null,"Cap",null," Income",null,null,null,"Cap",null,"Transfers to",null,"Transfers to",null,"Transfers to",null,"Transfers to",null,null,"Year",null,null,null,null,null,null,null,null,null,null,"Bucket 3",null,null,"Bucket","sys wit","sys wit",null,"B2",null,"B3",null,"B4",null,"B5"]
["Year","by corpus",null,null,null,null,null,null,null,null,null,null,null,null,null,null,null,null,null,null,"Bucket 1","Bucket 3","Bucket 1","Bucket 2","Bucket 1","Bucket 2","Bucket 1","Bucket 2",null,"Year",null,null,null,null,null,null,null,null,null,null,"Bucket 4",null,null,"strategy","avg ret","rand ret",null,null,"CAGR",null,"CAGR",null,"CAGR",null,"CAGR"]
[0,{"$f":"(prepen1*(1+rinf)^A12/100000)-(pension/100000)-(income*(1+incrate)^A12/100000)","v":7.1256238543002439},null,null,null,null,null,null,null,null,null,null,null,null,{"$f":"ROUND(Inputs!F19*Inputs!B20,0)/100000","v":90},{"$f":"ROUND(Inputs!F21*Inputs!B20,0)/100000","v":50},{"$f":"ROUND(Inputs!B20*Inputs!F22,0)/100000","v":20},{"$f":"ROUND(Inputs!B20*Inputs!F23,0)/100000","v":20},{"$f":"ROUND(Inputs!F24*Inputs!B20,0)/100000","v":20},null,null,null,null,null,null,null,null,null,null,0,null,null,null,null,null,null,null,null,null,null,"Bucket 5",null,null,{"$f":"Inputs!B20/100000","v":200},{"$f":"(Inputs!B12-prepen1)/100000","v":213.01497250320588},{"$f":"Inputs!B20/100000","v":200},null,1,null,1,null,1,null,1]
[{"$f":"A12+1","v":1},7.7356737626442662,null,{"$f":"IF(E13<>\"\",E13,_min1)","v":0.05},0.05,0.1197423283856266,{"$f":"IF(F13<>\"\",F13,NORMINV(RAND(),mean2,stdev2))","v":0.1197423283856266},0.14139740641492543,{"$f":"IF(H13<>\"\",H13,NORMINV(RAND(),mean3,stdev3))","v":0.14139740641492543},0.14387458323598337,{"$f":"IF(J13<>\"\",J13,NORMINV(RAND(),mean4,stdev4))","v":0.14387458323598337},{"$f":"IF(M13<>\"\",M13,NORMINV(RAND(),mean5,stdev5))","v":0.70761063500248778},0.70761063500248778,null,{"$f":"IF(O12=\"no funds\",\"no funds\",IF((O12-B12+U12+W12+Y12+AA12)*(1+D13)<0,\"no funds\",ROUND((O12-B12+U12+W12+Y12+AA12)*(1+D13),0)))","v":87},{"$f":"ROUND((P12-U12-V12+IF(trans3=\"bucket 2\",X12)+IF(trans4=\"bucket 2\",Z12)+IF(trans5=\"bucket 2\",AB12))*(1+F13),0)","v":56},{"$f":"ROUND((Q12-W12-X12+IF(trans2=\"bucket 3\",V12)+IF(trans4=\"bucket 3\",Z12)+IF(trans5=\"bucket 3\",AB12))*(1+H13),0)","v":23},{"$f":"ROUND((R12-Y12-Z12+IF(trans2=\"bucket 4\",V12)+IF(trans3=\"bucket 4\",X12)+IF(trans5=\"bucket 4\",AB12))*(1+J13),0)","v":23},{"$f":"ROUND((S12-AA12-AB12+IF(trans2=\"bucket 5\",V12)+IF(trans3=\"bucket 5\",X12)+IF(trans4=\"bucket 5\",Z12))*(1+M13),0)","v":34},null,null,null,null,null,null,null,null,null,null,{"$f":"AD12+1","v":1},null,null,null,null,null,null,null,null,{"$f":"IF($O13<$B13,$B13-$O13,0)","v":0},{"$f":"IF($O13<$B13,AD13,0)","v":0},null,null,null,{"$f":"IF(AQ13<>0,IF(SUM(O13:S13)<0,NA(),SUM(O13:S13)),NA())","v":{"$error":"#N/A"}},{"$f":"IF(AQ13<>0,IF(AS12*(1+retroi)-(prepen1/100000)*(1+rinf)^AQ13<0,NA(),AS12*(1+retroi)-(prepen1/100000)*(1+rinf)^AQ13),NA())","v":{"$error":"#N/A"}},{"$f":"IF(AQ13<>0,IF((AT12-B12)*(1+alloc1*Simulator!E13+alloc2*Simulator!F13+alloc3*Simulator!H13+alloc4*Simulator!J13+alloc5*Simulator!M13)<0,NA(),(AT12-B12)*(1+alloc1*Simulator!E13+alloc2*Simulator!F13+alloc3*Simulator!H13+alloc4*Simulator!J13+alloc5*Simulator!M13)),NA())","v":{"$error":"#N/A"}},null,{"$f":"AV12*(1+F13)","v":1.1197423283856267},{"$f":"(AV13/$AV$12)^(1/AQ13)-1","v":{"$error":"#DIV/0!"}},{"$f":"AX12*(1+H13)","v":1.1413974064149255},{"$f":"(AX13/$AX$12)^(1/AQ13)-1","v":{"$error":"#DIV/0!"}},{"$f":"AZ12*(1+J13)","v":1.1438745832359833},{"$f":"(AZ13/$AZ$12)^(1/AQ13)-1","v":{"$error":"#DIV/0!"}},{"$f":"BB12*(1+M13)","v":1.7076106350024878},{"$f":"(BB13/$BB$12)^(1/AQ13)-1","v":{"$error":"#DIV/0!"}}]
[2,8.3925276636558053,null,0.05,0.05,9.2947180681354505E-2,9.2947180681354505E-2,0.19423190013038577,0.19423190013038577,0.17036358164652907,0.17036358164652907,-3.1231291178219434E-2,-3.1231291178219434E-2,null,{"$f":"IF(O13=\"no funds\",\"no funds\",IF((O13-B13+U13+W13+Y13+AA13)*(1+D14)<0,\"no funds\",ROUND((O13-B13+U13+W13+Y13+AA13)*(1+D14),0)))","v":83},61,27,27,33,null,null,null,null,null,null,null,null,null,null,2,null,null,null,null,null,null,null,null,{"$f":"IF($O14<$B14,$B14-$O14,0)","v":0},{"$f":"IF($O14<$B14,AD14,0)","v":0},null,null,null,{"$f":"IF(AQ14<>0,IF(SUM(O14:S14)<0,NA(),SUM(O14:S14)),NA())","v":{"$error":"#N/A"}},{"$error":"#N/A"},{"$f":"IF(AQ14<>0,IF((AT13-B13)*(1+alloc1*Simulator!E14+alloc2*Simulator!F14+alloc3*Simulator!H14+alloc4*Simulator!J14+alloc5*Simulator!M14)<0,NA(),(AT13-B13)*(1+alloc1*Simulator!E14+alloc2*Simulator!F14+alloc3*Simulator!H14+alloc4*Simulator!J14+alloc5*Simulator!M14)),NA())","v":{"$error":"#N/A"}},null,{"$f":"AV13*(1+F14)","v":1.223819220898646},{"$error":"#DIV/0!"},{"$f":"AX13*(1+H14)","v":1.3630931934667907},{"$f":"(AX14/$AX$12)^(1/AQ14)-1","v":{"$error":"#DIV/0!"}},{"$f":"AZ13*(1+J14)","v":1.3387491541904961},{"$f":"(AZ14/$AZ$12)^(1/AQ14)-1","v":{"$error":"#DIV/0!"}},{"$f":"BB13*(1+M14)","v":1.6542797500417008},{"$f":"(BB14/$BB$12)^(1/AQ14)-1","v":{"$error":"#DIV/0!"}}]
[3,9.0997298767482722,null,0.05,0.05,5.6812678970990925E-2,5.6812678970990925E-2,0.10114182441148691,0.10114182441148691,0.10603073306064252,0.10603073306064252,-0.22176079945977326,-0.22176079945977326,null,78,64,30,30,26,null,null,null,null,null,null,null,null,null,null,3,null,null,null,null,null,null,null,null,0,0,"Bucket 2",null,null,{"$error":"#N/A"},{"$error":"#N/A"},{"$f":"IF(AQ15<>0,IF((AT14-B14)*(1+alloc1*Simulator!E15+alloc2*Simulator!F15+alloc3*Simulator!H15+alloc4*Simulator!J15+alloc5*Simulator!M15)<0,NA(),(AT14-B14)*(1+alloc1*Simulator!E15+alloc2*Simulator!F15+alloc3*Simulator!H15+alloc4*Simulator!J15+alloc5*Simulator!M15)),NA())","v":{"$error":"#N/A"}},null,1.2933476694140889,{"$error":"#DIV/0!"},1.5009589258969018,{"$error":"#DIV/0!"},1.4806977083936295,{"$error":"#DIV/0!"},1.2874253501423394,{"$error":"#DIV/0!"}]
[4,9.8610882668881352,null,0.05,0.05,0.13784381000320323,0.13784381000320323,0.15158367463447675,0.15158367463447675,-0.20614057706544064,-0.20614057706544064,0.35504115338700992,0.35504115338700992,null,72,73,35,24,35,null,null,null,null,null,null,null,null,null,null,4,null,null,null,null,null,null,null,null,0,0,"Bucket 4",null,null,{"$error":"#N/A"},{"$error":"#N/A"},{"$f":"IF(AQ16<>0,IF((AT15-B15)*(1+alloc1*Simulator!E16+alloc2*Simulator!F16+alloc3*Simulator!H16+alloc4*Simulator!J16+alloc5*Simulator!M16)<0,NA(),(AT15-B15)*(1+alloc1*Simulator!E16+alloc2*Simulator!F16+alloc3*Simulator!H16+alloc4*Simulator!J16+alloc5*Simulator!M16)),NA())","v":{"$error":"#N/A"}},null,1.4716276398248904,{"$error":"#DIV/0!"},1.7284797953597715,{"$error":"#DIV/0!"},1.1754658283258912,{"$error":"#DIV/0!"},1.7445143313565508,{"$error":"#DIV/0!"}]
[5,10.680693328239183,null,0.05,0.05,5.7540041808505263E-2,5.7540041808505263E-2,8.960432383408741E-2,8.960432383408741E-2,-0.20275521395388424,-0.20275521395388424,-0.40658749665233374,-0.40658749665233374,null,65,77,38,19,21,null,null,null,null,null,null,null,null,null,null,5,null,null,null,null,null,null,null,null,0,0,"Bucket 5",null,null,{"$error":"#N/A"},{"$error":"#N/A"},{"$f":"IF(AQ17<>0,IF((AT16-B16)*(1+alloc1*Simulator!E17+alloc2*Simulator!F17+alloc3*Simulator!H17+alloc4*Simulator!J17+alloc5*Simulator!M17)<0,NA(),(AT16-B16)*(1+alloc1*Simulator!E17+alloc2*Simulator!F17+alloc3*Simulator!H17+alloc4*Simulator!J17+alloc5*Simulator!M17)),NA())","v":{"$error":"#N/A"}},null,1.5563051557469665,{"$error":"#DIV/0!"},1.8833590586838656,{"$error":"#DIV/0!"},0.93713400280819548,{"$error":"#DIV/0!"},1.0352166164961709,{"$error":"#DIV/0!"}]
[6,11.562938594498322,null,0.05,0.05,7.784150522918018E-2,7.784150522918018E-2,8.3930243039595509E-2,8.3930243039595509E-2,0.40291155167544801,0.40291155167544801,0.32577676792652249,0.32577676792652249,null,57,83,41,27,28,null,null,null,null,null,null,null,null,null,null,6,null,null,null,null,null,null,null,null,0,0,null,null,null,{"$error":"#N/A"},{"$error":"#N/A"},{"$f":"IF(AQ18<>0,IF((AT17-B17)*(1+alloc1*Simulator!E18+alloc2*Simulator!F18+alloc3*Simulator!H18+alloc4*Simulator!J18+alloc5*Simulator!M18)<0,NA(),(AT17-B17)*(1+alloc1*Simulator!E18+alloc2*Simulator!F18+alloc3*Simulator!H18+alloc4*Simulator!J18+alloc5*Simulator!M18)),NA())","v":{"$error":"#N/A"}},null,1.6774502916662439,{"$error":"#DIV/0!"},2.0414298422100265,{"$error":"#DIV/0!"},1.3147161180074691,{"$error":"#DIV/0!"},1.3724661399221239,{"$error":"#DIV/0!"}]
[7,12.512542462058187,null,0.05,0.05,9.9238296886664107E-2,9.9238296886664107E-2,0.21212692474437295,0.21212692474437295,5.074483666773244E-2,5.074483666773244E-2,0.19574362786413974,0.19574362786413974,null,48,91,50,28,33,null,null,null,null,null,null,null,null,null,null,7,null,null,null,null,null,null,null,null,0,0,"Bucket 2",null,null,{"$error":"#N/A"},{"$error":"#N/A"},{"$f":"IF(AQ19<>0,IF((AT18-B18)*(1+alloc1*Simulator!E19+alloc2*Simulator!F19+alloc3*Simulator!H19+alloc4*Simulator!J19+alloc5*Simulator!M19)<0,NA(),(AT18-B18)*(1+alloc1*Simulator!E19+alloc2*Simulator!F19+alloc3*Simulator!H19+alloc4*Simulator!J19+alloc5*Simulator!M19)),NA())","v":{"$error":"#N/A"}},null,1.8439176017232399,{"$error":"#DIV/0!"},2.4744720767194299,{"$error":"#DIV/0!"},1.3814311726801933,{"$error":"#DIV/0!"},1.6411176412711725,{"$error":"#DIV/0!"}]
[8,13.53457151702284,null,0.05,0.05,0.11456173960446914,0.11456173960446914,0.19179101687202324,0.19179101687202324,-3.4637232764829384E-2,-3.4637232764829384E-2,0.38774630332929416,0.38774630332929416,null,37,101,60,27,46,null,null,null,null,null,null,null,null,null,null,8,null,null,null,null,null,null,null,null,0,0,"Bucket 3",null,null,{"$f":"IF(AQ20=SUM(AN7:AN1106),NA(),IF(AQ20<>0,IF(SUM(O20:S20)<0,NA(),SUM(O20:S20)),NA()))","v":{"$error":"#N/A"}},{"$f":"IF(AQ20=SUM(AN7:AN1106),NA(),IF(AQ20<>0,IF(AS19*(1+retroi)-(prepen1/100000)*(1+rinf)^AQ20<0,NA(),AS19*(1+retroi)-(prepen1/100000)*(1+rinf)^AQ20),NA()))","v":{"$error":"#N/A"}},{"$f":"IF(AQ20=SUM(AN7:AN1106),NA(),IF(AQ20<>0,IF((AT19-B19)*(1+alloc1*Simulator!E20+alloc2*Simulator!F20+alloc3*Simulator!H20+alloc4*Simulator!J20+alloc5*Simulator!M20)<0,NA(),(AT19-B19)*(1+alloc1*Simulator!E20+alloc2*Simulator!F20+alloc3*Simulator!H20+alloc4*Simulator!J20+alloc5*Simulator!M20)),NA()))","v":{"$error":"#N/A"}},null,2.0551600098639549,{"$error":"#DIV/0!"},2.9490535925348764,{"$error":"#DIV/0!"},1.3335822196034781,{"$error":"#DIV/0!"},2.2774549400025603,{"$error":"#DIV/0!"}]
{"$rows_left_out":92}
{"sheet":"Example results","index":3,"n_rows":0,"n_cols":0,"rows_kept":0,"cut":false,"hidden":false,"merged":[]}

{"sheet":"Read me whenever!","index":4,"n_rows":34,"n_cols":10,"rows_kept":34,"cut":false,"hidden":false,"merged":[]}
["Background and Motivation"]
["Mr. P V Subramanyam (subramoney.com) introduced the idea of retirement buckets and urged me to a build a calculator. When I looked around for"]
["what was available I first ound a terrific free version offered by ISG Planning (and stopped looking!)"]
["This simulator is inspired by and influenced by the free Investment Income Simulator available at ",null,null,null,null,null,null,null,null,"ISG Planning"]
["That said the simulator has been bulit independently from the ground-up. Why do this when something is already available for free? I believe my version offers "]
["additional flexibility and features. These include: "]
["1. an extra investment bucket with information on how long the initial allocation to bucket 1 will last."]
["2. a standard retirment calculator and comparison with the bucket stratergy"]
["3. Choice of defining the volatility in each bucket"]
["4. Choice of including annuity and additonal income"]
["Some useful features in the ISG version are not (yet!) available. There are also some differences. For example:"]
["a. Correlation among the different kind of stocks"]
["b. Dividends from stocks is not considered"]
["c. The exact nature of the Monte Carlo simulation used by ISG is not known. I have simply used random returns that obey a Normal distribution without any averaging"]
["Sometimes the random returns may not reflect historic market trends. As this is only a informative and practice tool I don't intende to change this unless there is interest from users"]
["d. Of course the ISG version is way more better looking and user friendly than mine. However I am not going to lose sleep over this."]
["I made this calculator because I  believe diversification (ie. Additional buckets) with a wide range in volatility maybe necessary to combat high inflation rates that prevail in India. "]
[]
["Remember: This is a work in progress. I have tried this out several times to weed out errors. No guarantees can however be made that it is error free. If you find a bug kindly bring it to my notice."]
[]
{"$rows_left_out":14}